{"text_format":"3","workbook":"xlsx","n_sheets":4,"sheets":["Calculos","Hidraulica","Estructuras","ayuda"],"not_rendered":{"images":35,"macros":1,"defined_names":8},"read":"whole","date_system":"1900"}

{"sheet":"Calculos","index":0,"n_rows":73,"n_cols":17,"rows_kept":73,"merged":[[4,5,4,6],[4,9,4,10],[5,5,5,6],[5,9,5,10],[6,5,6,6],[6,9,6,10],[7,5,7,6],[7,9,7,10],[8,5,8,6],[8,9,8,10],[23,5,23,6],[23,9,23,10],[24,5,24,6],[24,9,24,10],[25,5,25,6],[25,9,25,10],[26,5,26,6],[26,9,26,10],[27,5,27,6],[27,9,27,10],[28,5,28,6],[28,9,28,10],[70,0,70,1]]}
["Datos",{"$nulls":3},1]
["Qmd",null,"l/s",null,2]
["Qmax",{"$f":"+Hidraulica!I10","v":{"v":5,"d":"5.0000"}},"l/s",{"$nulls":12},"h",{"$f":"+IF(E1=1,B17+B18*0.0254+B19,\"\")","v":{"v":0.4508,"d":"0.45"}}]
["coeficiente descarga (Cd)",{"$f":"+Hidraulica!I12","v":{"v":0.8,"d":"0.8000"}}]
["V2",{"$f":"+Hidraulica!I14","v":{"v":0.6,"d":"0.6000"}},"m/s",null,null,"Long. afloram. - camara (L) :",null,{"$f":"+IF(E1=1,B11,\"\")","v":{"v":1.24,"d":"1.24 m"}},"m","Altura camara humeda (Ht) :",null,{"$f":"+IF(E1=1,B22,\"\")","v":{"v":0.9508000000000001,"d":"0.95"}},"m"]
["g",{"v":9.81,"d":"9.8100"},"m/s2",{"$nulls":12},"H",{"$f":"+IF(E1=1,B20+B21,\"\")","v":{"v":0.5,"d":"0.50"}}]
["ho=",{"$f":"+(1.56*(Velocidad^2))/(2*gravedad)","v":{"v":0.028623853211009173,"d":"0.0286"}},"m",null,null,"Ancho de pantalla (b) :",null,{"$f":"+IF(E1=1,B16,\"\")","v":{"v":1.6764,"d":"1.68 m"}},"m","N° ranuras de canastilla :",null,{"$f":"+IF(E1=1,B27,\"\")","v":{"v":6,"d":"6.00"}},"und"]
["H",{"$f":"+Hidraulica!I16","v":{"v":0.4,"d":"0.4000"}},"m"]
["Hf",{"$f":"+alturaH-alturaHo","v":{"v":0.37137614678899084,"d":"0.3714"}},"m",null,null,"Numero de orificios (NA) :",null,{"$f":"+IF(E1=1,B15,\"\")","v":{"v":6,"d":"6.00"}},"und","Tub. rebose - limpia (D) :",null,{"$f":"+IF(E1=1,C28,\"\")","v":{"v":4,"d":"4.00"}},"pulg"]
["Resultados:"]
["Distancia (L)",{"$f":"+ROUND(PerdidaHf/0.3,2)","v":{"v":1.24,"d":"1.2400"}},"m"]
["Area de Tub. (A)",{"$f":"+(B3/(B4*Velocidad))/1000","v":{"v":0.010416666666666668,"d":"0.0104"}},"m2"]
["diametro (D)",{"$f":"+(((4*B12)/PI())^0.5)/0.0254","v":{"v":4.534043956316739,"d":"4.5340"}},"pulg"]
["Diametro Asumido",{"$f":"+Hidraulica!I18","v":{"v":2,"d":"2.0000"}},"pulg"]
["NA",{"$f":"+ROUND(((B13^2)/(B14^2))+1,0)","v":{"v":6,"d":"6.0000"}}]
["Ancho de pantalla (b)",{"$f":"+((9*B14)+(4*B15*B14))*0.0254","v":1.6764},"m",{"$nulls":4},{"$f":"+H7","v":{"v":1.6764,"d":"1.68 m"}}]
["A",{"$f":"+Hidraulica!I20","v":{"v":0.1,"d":"0.1000"}},"m"]
["Diametro de Salida (B)",{"$f":"+Hidraulica!M10","v":{"v":2,"d":"2.0000"}},"pulg"]
["H",{"$f":"+IF(alturaHo<=0.3,0.3,ROUND(alturaHo,2))","v":{"v":0.3,"d":"0.3000"}},"m"]
["D",{"$f":"+Hidraulica!M12","v":{"v":0.2,"d":"0.2000"}},"m"]
["Borde libre E",{"$f":"+Hidraulica!M14","v":{"v":0.3,"d":"0.3000"}},"m"]
["Ht",{"$f":"+B17+(B18*0.0254)+B19+B20+B21","v":0.9508000000000001},"m"]
["Ac",{"$f":"+(PI()*(B18^2))/4","v":{"v":3.141592653589793,"d":"3.1416"}},"pulg2"]
["area total de ranuras At",{"$f":"2*B23*0.0254","v":{"v":0.1595929068023615,"d":"0.1596"}},"m2"]
["long. De canastilla (L)",{"$f":"+Hidraulica!M16","v":{"v":0.15,"d":"0.1500"}},"m",null,null,"Empuje suelo sobre muro :",null,{"$f":"+IF(E2=2,B34,\"\")","v":{"v":0.26666666666666666,"d":"0.27 m"}},"tn","Chequeo por vuelco (Cdv) :",null,{"$f":"+IF(E2=2,B40,\"\")","v":{"v":2.5875,"d":"2.59"}},{"$f":"+IF(E2=2,C40,\"\")","v":"ok"}]
["Area de Ranuras",{"$f":"+Hidraulica!M18","v":{"v":0.035,"d":"0.0350"}},"m2"]
["N° de Ranuras",{"$f":"+ROUND((B24/B26)+1,0)","v":{"v":6,"d":"6.0000"}},{"$nulls":3},"Momento de Vuelco (Mo) :",null,{"$f":"+IF(E2=2,B35,\"\")","v":{"v":0.08888888888888888,"d":"0.09"}},"tn-m","Chequeo deslizamiento (Dz) :",null,{"$f":"+IF(E2=2,B47,\"\")","v":{"v":2.0250000000000004,"d":"2.03"}},{"$f":"+IF(E2=2,C47,\"\")","v":"ok"}]
["diametro de rebose",{"$f":"++ROUND((0.71*(B3^0.38))/((0.015)^0.21),1)","v":{"v":3.2,"d":"3.2000"}},{"$f":"+IF(B28<=1,1,IF(B28<=1.5,1.5,IF(B28<=2,2,IF(B28<=2.5,2.5,IF(B28<=3,3,IF(B28<=4,4,IF(B28<=6,6,6)))))))","v":4},"pulg"]
["Altura de Muro h",{"$f":"+Estructuras!I10","v":{"v":1,"d":"1.0000"}},"m",null,null,"Momento estabilizador (Mr) :",null,{"$f":"+IF(E2=2,B38,\"\")","v":{"v":0.22999999999999998,"d":"0.23"}},"tn-m","Chequeo Max. Carga Unit :",null,{"$f":"+IF(E2=2,C41,\"\")","v":{"v":2.023703703703704,"d":"2.02"}},{"$f":"+IF(E2=2,D41,\"\")","v":"ok"}]
["angulo de friccion Ø",{"$f":"+Estructuras!I12","v":{"v":30,"d":"30.0000"}}]
["Capacidad de carga del terreno",{"$f":"+Estructuras!I16","v":{"v":10,"d":"10.0000"}},"tn/m2"]
["peso especifico del suelo",{"$f":"+Estructuras!I14","v":{"v":1.6,"d":"1.6000"}},"tn/m3"]
["coheficiente de empuje Cah",{"$f":"+(1-SIN(B30*(PI()/180)))/(1+SIN(B30*(PI()/180)))","v":{"v":0.3333333333333333,"d":"0.3333"}}]
["Empuje del suelo Sobre el muro P",{"$f":"+(B33*B32*(B29^2))/2","v":{"v":0.26666666666666666,"d":"0.2667"}},"tn"]
["Momento de Vuelco Mo",{"$f":"+B34*(B29/3)","v":{"v":0.08888888888888888,"d":"0.0889"}},"tn-m"]
["L",{"$f":"+Estructuras!I18","v":{"v":1.5,"d":"1.5000"}}]
["peso estabilizador (Wt)",{"$f":"+Estructuras!M10","v":{"v":0.9,"d":"0.9000"}},"tn"]
["Momento estabilizador Mr",{"$f":"+(0.5*0.15*2.4+0.075*0.15*2.4)/B37","v":{"v":0.22999999999999998,"d":"0.2300"}},"tn-m"]
["a",{"$f":"+(B38-B35)/B37","v":{"v":0.1567901234567901,"d":"0.1568"}}]
["chequeo por vuelco Cdv",{"$f":"+B38/B35","v":2.5875},{"$f":"+IF(B40>B45,\"ok\",\"Recalcular\")","v":"ok"}]
["p1",{"$f":"+(4*B36-6*B39)*(B37/(B36^2))","v":{"v":2.023703703703704,"d":"2.0237"}},{"$f":"+IF(B41>B42,B41,B42)","v":2.023703703703704},{"$f":"+IF(C41<=B31,\"ok\",\"Recalcular\")","v":"ok"}]
["p1",{"$f":"+(6*B39-2*B36)*(B37/(B36^2))","v":{"v":-0.8237037037037038,"d":"-0.8237"}}]
["Coheficiente de friccion suelo estructura U",{"$f":"+Estructuras!M12","v":{"v":0.6,"d":"0.6000"}}]
["FSD",{"$f":"+Estructuras!M14","v":{"v":1.5,"d":"1.5000"}}]
["FSV",{"$f":"+Estructuras!M16","v":{"v":1.75,"d":"1.7500"}}]
["F",{"$f":"+B43*B37","v":{"v":0.54,"d":"0.5400"}}]
["Chequeo por deslizamiento",{"$f":"+B46/B34","v":{"v":2.0250000000000004,"d":"2.0250"}},{"$f":"+IF(B47>B44,\"ok\",\"Recalcular\")","v":"ok"}]
["Resumen:"]
[]
[]
[{"$f":"+A11","v":"Distancia (L)"},{"$f":"+B11","v":{"v":1.24,"d":"1.2400 m"}}]
[]
[{"$f":"+A15","v":"NA"},{"$f":"+B15","v":{"v":6,"d":"6.0000"}}]
[]
[{"$f":"+A16","v":"Ancho de pantalla (b)"},{"$f":"+B16","v":{"v":1.6764,"d":"1.6764 m"}}]
[]
["Area hidraulica (A)",{"$f":"+IF(B7=0,\"\",B13)","v":{"v":4.534043956316739,"d":"4.5340 m2"}}]
[]
["Perimetro (P)",{"$f":"+IF(B7=0,\"\",B14)","v":{"v":2,"d":"2.0000 m"}}]
[]
["Radio hidráulico (R)",{"$f":"+IF(B7=0,\"\",B15)","v":{"v":6,"d":"6.0000 m"}}]
[]
["Espejo de agua (T)",{"$f":"+IF(B7=0,\"\",B16)","v":{"v":1.6764,"d":"1.6764 m"}}]
[]
["Num.de Froude (F)",{"$f":"+IF(B7=0,\"\",B17)","v":{"v":0.1,"d":"0.1000"}}]
[]
["Tipo de Flujo:",{"$f":"+IF(B7=0,\"\",B18)","v":{"v":2,"d":"2.0000"}}]
[]
["En.Específica(E)",{"$f":"+IF(B7=0,\"\",B19)","v":{"v":0.3,"d":"0.3000 m-kg/kg"}}]
[]
[{"$f":"+IF(B67<0,\"El tirante es mayor que el diámetro. Incremente el Diámetro o la Pendiente\",\"\")","v":""}]
["Pendiente (s)",{"$f":"+IF(B7=0,\"\",B9)","v":{"v":0.37137614678899084,"d":"0.3714"}},{"$nulls":5},{"$f":"NOW()","v":42430.633389814815}]
[{"$nulls":7},{"$f":"TODAY()","v":"2016-03-01"}]

{"sheet":"Hidraulica","index":1,"n_rows":34,"n_cols":14,"rows_kept":34,"merged":[[2,1,2,11],[4,1,4,2],[4,4,4,5],[4,7,4,8],[4,10,4,11],[9,6,9,7],[9,10,9,11],[10,6,10,7],[10,10,10,11],[11,6,11,7],[11,10,11,11],[12,6,12,7],[12,10,12,11],[13,6,13,7],[13,10,13,11],[14,6,14,7],[14,10,14,11],[15,6,15,7],[15,10,15,11],[16,6,16,7],[16,10,16,11],[17,6,17,7],[17,10,17,11],[18,6,18,7],[18,10,18,11],[19,6,19,7],[19,10,19,11],[20,6,20,7],[20,10,20,11],[21,6,21,7],[21,10,21,11],[22,6,22,7],[22,10,22,11],[23,6,23,7],[23,10,23,11],[24,6,24,7],[29,6,29,7],[29,10,29,11],[30,6,30,7],[30,10,30,11],[31,6,31,7],[31,10,31,11],[32,6,32,7],[32,10,32,11],[33,6,33,7],[33,10,33,11]]}
[]
[]
["Proyecto            :","Instalacion Del Servicio De Agua Potable En La Localidad De San Jose De Ninabamba Del Distrito De Ocros "]
[]
["Region              :","Ayacucho",null,"    Provincia: ","Huamanga",null,"            Distrito:","Ocros",null,"    Lugar:","San Jose de Ninabamba"]
[]
[]
[{"$nulls":6},"Datos:"]
[]
[{"$nulls":6},"Gasto max. de fuente (Qmax):",null,{"v":5,"d":"5.000"},"lts/seg","Diametro tub. salida :",null,{"v":2,"d":"2.000"},"pulg"]
[]
[{"$nulls":6},"Coeficiente descarga (Cd) :",null,{"v":0.8,"d":"0.800"},null,"Desnivel camara - orificio :",null,{"v":0.2,"d":"0.200"},"m"]
[]
[{"$nulls":6},"Velocidad de pase :",null,{"v":0.6,"d":"0.600"},"m/seg","Borde Libre :",null,{"v":0.3,"d":"0.300"},"m"]
[]
[{"$nulls":6},"Altura al aflorameinto :",null,{"v":0.4,"d":"0.400"},"m","Long. de Canastilla :",null,{"v":0.15,"d":"0.150"},"m"]
[]
[{"$nulls":6},"Diametro de orificio (Ø) :",null,{"v":2,"d":"2.000"},"pulg","Area de ranuras :",null,0.035,"m²"]
[]
[{"$nulls":6},"Altura de Sedimentacion :",null,{"v":0.1,"d":"0.100"},"m"]
[]
[]
[]
[{"$nulls":6},"Alfredo-pf@hotmail.com"]
[{"$nulls":6},"RPM. #0217074"]
[]
[]
[{"$nulls":6},"Resultados:"]
[]
[{"$nulls":6},"Long. afloram. - camara (L) :",null,{"$f":"+Calculos!H5","v":{"v":1.24,"d":"1.240"}},"m","Altura camara humeda (Ht) :",null,{"$f":"+Calculos!L5","v":{"v":0.9508000000000001,"d":"0.951"}},"m"]
[]
[{"$nulls":6},"Ancho de pantalla (b) :",null,{"$f":"+Calculos!H7","v":{"v":1.6764,"d":"1.676"}},"m","N° ranuras de canastilla :",null,{"$f":"+Calculos!L7","v":{"v":6,"d":"6.000"}},"und"]
[]
[{"$nulls":6},"Numero de orificios (NA) :",null,{"$f":"+Calculos!H9","v":{"v":6,"d":"6.000"}},"und","Tub. rebose - limpia (D) :",null,{"$f":"+Calculos!L9","v":{"v":4,"d":"4.000"}},"pulg"]

{"sheet":"Estructuras","index":2,"n_rows":33,"n_cols":14,"rows_kept":33,"merged":[[2,1,2,11],[4,1,4,2],[4,4,4,5],[4,7,4,8],[4,10,4,11],[9,6,9,7],[9,10,9,11],[10,6,10,7],[10,10,10,11],[11,6,11,7],[11,10,11,11],[12,6,12,7],[12,10,12,11],[13,6,13,7],[13,10,13,11],[14,6,14,7],[14,10,14,11],[15,6,15,7],[15,10,15,11],[16,6,16,7],[16,10,16,11],[17,6,17,7],[17,10,17,11],[18,6,18,7],[18,10,18,11],[19,6,19,7],[19,10,19,11],[20,6,20,7],[20,10,20,11],[21,6,21,7],[21,10,21,11],[22,6,22,7],[22,10,22,11],[25,6,25,7],[25,10,25,11],[26,6,26,7],[26,10,26,11],[27,6,27,7],[27,10,27,11],[28,6,28,7],[28,10,28,11],[29,6,29,7],[29,10,29,11],[32,0,32,13],[33,0,33,13],[34,0,34,13]]}
[]
[]
["Proyecto            :",{"$f":"+Hidraulica!B3","v":"Instalacion Del Servicio De Agua Potable En La Localidad De San Jose De Ninabamba Del Distrito De Ocros "}]
[]
["Region              :",{"$f":"+Hidraulica!B5","v":"Ayacucho"},null,"    Provincia: ",{"$f":"+Hidraulica!E5","v":"Huamanga"},null,"            Distrito:",{"$f":"+Hidraulica!H5","v":"Ocros"},null,"    Lugar:",{"$f":"+Hidraulica!K5","v":"San Jose de Ninabamba"}]
[]
[]
[{"$nulls":6},"Datos:"]
[]
[{"$nulls":6},"Altura de muro (Ht):",null,{"v":1,"d":"1.000"},"m","Peso de la estructura (Wt) :",null,{"v":0.9,"d":"0.900"},"tn"]
[]
[{"$nulls":6},"Angulo inteno del suelo (Ø) :",null,{"v":30,"d":"30.000"},null,"Coef.  friccion suelo-estruc. :",null,{"v":0.6,"d":"0.600"}]
[]
[{"$nulls":6},"Peso especifico del suelo (δ) :",null,{"v":1.6,"d":"1.600"},"tn/m³","FSD :",null,{"v":1.5,"d":"1.500"}]
[]
[{"$nulls":6},"Capacidad carga del suelo :",null,{"v":10,"d":"10.000"},"tn/m²","FSV :",null,{"v":1.75,"d":"1.750"}]
[]
[{"$nulls":6},"Longitud (L) :",null,{"v":1.5,"d":"1.500"},"m"]
[]
[{"$nulls":6},"Alfredo-pf@hotmail.com"]
[{"$nulls":6},"RPM. #0217074"]
[]
[]
[{"$nulls":6},"Resultados:"]
[]
[{"$nulls":6},"Empuje suelo sobre muro :",null,{"$f":"+Calculos!H25","v":{"v":0.26666666666666666,"d":"0.267"}},"tn","Chequeo por vuelco (Cdv) :",null,{"$f":"+Calculos!L25","v":{"v":2.5875,"d":"2.588"}},{"$f":"+Calculos!M25","v":"ok"}]
[]
[{"$nulls":6},"Momento de Vuelco (Mo) :",null,{"$f":"+Calculos!H27","v":{"v":0.08888888888888888,"d":"0.089"}},"tn-m","Chequeo deslizamiento (Dz) :",null,{"$f":"+Calculos!L27","v":{"v":2.0250000000000004,"d":"2.025"}},{"$f":"+Calculos!M27","v":"ok"}]
[]
[{"$nulls":6},"Momento estabilizador (Mr) :",null,{"$f":"+Calculos!H29","v":{"v":0.22999999999999998,"d":"0.230"}},"tn-m","Chequeo Max. Carga Unit :",null,{"$f":"+Calculos!L29","v":{"v":2.023703703703704,"d":"2.024"}},{"$f":"+Calculos!M29","v":"ok"}]
[]
[]
["No se provee Garantía ni seguro alguno sobre el uso y comportamiento del programa. Para cualquier sugerencia que sirva mejorar el presente trabajo dirigirse a la sgte dirección Ricardo Palma N° 108 Abancay - RPM #0217074 (Apurímac - Perú). Para una ayuda del calculo darle click en el logo (AR)."]

{"sheet":"ayuda","index":3,"n_rows":412,"n_cols":12,"rows_kept":412,"merged":[[5,0,10,7],[53,0,53,7],[64,0,64,7],[66,1,66,8],[259,0,262,6],[300,0,305,5]]}
[]
[]
[]
["a) Diseño hidráulico y dimensionamiento"]
[]
["Para el dimensionamiento de la captación es necesario conocer el caudal máximo de la fuente, de modo que el diámetro de los orificios de entrada a la cámara húmeda sea suficiente para captar este caudal o gasto.\nConocido el gasto, se puede diseñar el área de orificio sobre la base de una velocidad de entrada no muy alta y al coeficiente de contracción de los orificios."]
{"$rows_empty":34}
["Calculo de la distancia entre el afloramiento y la cámara húmeda."]
[]
["Es necesario conocer la velocidad de pase y la pérdida de carga sobre el orificio de\nsalida (figura 1.1). Según la ecuación de Bernoulli entre los puntos 0 y 1, resulta:"]
["  "]
[]
[]
[]
[]
[]
["Considerando los valores de P0, V0, P1 y h1 igual a cero, se tiene:"]
{"$rows_empty":14}
[{"$nulls":11},{"$f":"0.75*0.75","v":0.5625}]
[]
[{"$nulls":9},{"$f":"0.6/0.8","v":0.7499999999999999}]
[{"$nulls":9},{"$f":"+J67^2","v":0.5624999999999998},null,{"$f":"1.56*(0.5)^2","v":0.39}]
[{"$nulls":9},{"$f":"9.81*2","v":19.62},null,0.8]
[{"$nulls":9},{"$f":"+J68/J69","v":{"v":0.02866972477064219,"d":"0.029"}},null,{"$f":"+L68/L69","v":0.4875}]
[]
[]
[]
[{"$nulls":11},{"$f":"2*9.81*0.8","v":15.696000000000002}]
[]
["Donde:"]
["V2 = Velocidad de pase (se recomienda valores menores o iguales a 0,6 m/s)."]
["Cd = Coeficiente de descarga en el punto 1 (se asume 0,8)."]
[]
["Reemplazando el valor de 1 V de la ecuación (2) en la ecuación (1), se tiene:"]
{"$rows_empty":22}
["Donde Hf es la pérdida de carga que servirá para determinar la distancia entre el"]
["afloramiento y la caja de captación (L)."]
["Hf = H – ho"]
["Hf = 0.30 x L"]
["L = Hf / 0.30"]
[]
["Ancho de la pantalla (b)"]
[]
["Para determinar el ancho de la pantalla es necesario conocer el diámetro y el número"]
["de orificios que permitirán fluir el agua desde la zona de afloramiento hacia la"]
["cámara húmeda. Para el cálculo del diámetro de la tubería de entrada (D), se utilizan"]
["las siguientes ecuaciones."]
[]
["Qmáx. = V x A x Cd"]
["Qmáx. = A Cd (2 g h )1/2"]
[]
["Donde:"]
["Q máx. = Gasto Máximo de la fuente en l/s."]
["V = Velocidad de paso (se asume 0,50 m/s, siendo menor que el valor máximo recomendado de 0,60 m/s)."]
["A = Área de la tubería en m2"]
["Cd = Coeficiente de descarga (0,6 a 0,8)."]
["G = Aceleración de la gravedad (9,81 m/s2)"]
["h = Carga sobre el centro del orificio (m)."]
[]
["El valor de A resulta:"]
[]
[]
[]
[]
[]
[]
["Considerando la carga sobre el centro del orificio el valor de A será:"]
{"$rows_empty":7}
["El valor de D será definido mediante:"]
[]
[]
[]
[]
["Número de orificios: "]
["Se recomienda usar diámetros (D) menores o iguales de 2”. Si se obtuvieran diámetros mayores, será necesario aumentar el número de orificios (NA), siendo:"]
{"$rows_empty":35}
["Para el cálculo del ancho de la pantalla, se asume que para una buena distribución"]
["del agua los orificios se deben ubicar como se muestra en la figura 1.3."]
[]
["Siendo:"]
["“d” el diámetro de la tubería de entrada"]
["“b” el ancho de la pantalla"]
["Conocido el número de orificios y el diámetro de la tubería de entrada, se calcula el"]
["ancho de la pantalla (b) mediante la siguiente ecuación:"]
[]
["b = 2(6D) + NA D + 3D (NA – 1)"]
["b = 12 D + NAD + 3 NAD – 3D"]
["b = 9D + 4 NAD"]
[]
["Donde:"]
["b = Ancho de la pantalla"]
["D = Diámetro del orificio"]
["NA = Número de orificios"]
[]
["Altura de la cámara húmeda"]
[]
["En base a los elementos identificados de la figura 1.4, la altura total de la cámara"]
["húmeda se calcula mediante la siguiente ecuación:"]
["Ht = A + B + H + D + E"]
[]
["Donde:"]
["A = Se considera una altura mínima de 10 cm. Que permite la sedimentación de la arena."]
["B = Se considera el diámetro de salida."]
["H = Altura de agua sobre la canastilla."]
["D = Desnivel mínimo entre el nivel de ingreso del agua del afloramiento y el nivel de agua de la cámara húmeda (mínimo 5 cm.)."]
["E = Borde libre (mínimo 30 cm)."]
{"$rows_empty":26}
["Para determinar la altura de la captación, es necesario conocer la carga requerida"]
["para que el gasto de salida de la captación pueda fluir por la tubería de conducción."]
["La carga requerida es determinada mediante la siguiente ecuación:"]
{"$rows_empty":8}
["Donde:"]
["H = Carga requerida en m"]
["V = Velocidad promedio en la salida de la tubería de la línea de conducción en m/s"]
["G = Aceleración de la gravedad igual 9,81 m/s2"]
["Se recomienda una altura mínima de H = 30 cm"]
[]
["Dimensionamiento de la canastilla"]
[]
["Para el dimensionamiento se considera que el diámetro de la canastilla debe ser dos"]
["veces el diámetro de la tubería de salida a la línea de conducción (Dc); que el área\ntotal de ranuras (At) sea el doble del área de la tubería de la línea de conducción; y que la longitud\nde la canastilla (L) sea mayor a 3 Dc y menor de 6Dc."]
[]
[]
[]
["At = 2 Ac"]
[]
["Donde:"]
[]
[]
[]
[]
[]
[]
["Conocidos los valores del área total de ranuras y el área de cada ranura se determina"]
["el número de ranuras:"]
[]
[]
[]
[]
[]
[]
["Tubería de rebose y limpia"]
[]
["En la tubería de rebose y de limpia se recomienda pendientes de 1 a 1,5% y"]
["considerando el caudal máximo de aforo, se determina el diámetro mediante la"]
["ecuación de Hazen y Williams (para C=140)."]
{"$rows_empty":8}
["Donde:"]
["D = Diámetro en pulgadas"]
["Q = Gasto máximo de la fuente en lps"]
["S = Pérdida de carga unitaria en m/m"]
[]
["b) Diseño estructural"]
[]
["Para el diseño estructural se considera el muro sometido al empuje de la tierra\ncuando la caja está vacía. Si está llena, el empuje hidrostático tiene un\ncomponente en el empuje de la tierra, favoreciendo de esta manera la\nestabilidad del muro. Las cargas consideradas son: el peso propio, el empuje de la tierra y la subpresión."]
{"$rows_empty":25}
["Para garantizar la estabilidad del muro, se debe verificar que la carga unitaria sea"]
["igual o menor a la capacidad de la carga del terreno; mientras que para garantizar la"]
["estabilidad del muro al deslizamiento y al volteo, se deberá verificar un coeficiente"]
["de seguridad no menor a 1,6."]
[]
["Empuje del suelo sobre el muro (P)"]
{"$rows_empty":77}
["Donde:"]
["u = Coeficiente de fricción, suelo – estructura concreto"]
["Wt = Peso total de la estructura."]